slack-v
type: LexicalEntry
canonical form: slack
sense: 00215050-v
part of speech: verb

slake-v
type: LexicalEntry
canonical form: slake
sense: 00215050-v
part of speech: verb

00215050-v
type: LexicalConcept
in scheme: en-word.net
definition: cause to heat and crumble by treatment with water
example: slack lime
ili: i22792
lexfile: verb.change
part of speech: verb
hypernym: 00214446-v