hydrate-v
type: LexicalEntry
canonical form: hydrate
sense: 00214446-v
part of speech: verb

00214446-v
type: LexicalConcept
in scheme: en-word.net
definition: cause to be hydrated; add water or moisture to
example: hydrate your skin
ili: i22789
lexfile: verb.change
part of speech: verb
hypernym: 00216226-v
similar: 00214694-v
similar: 00214833-v