tin-v
type: LexicalEntry
canonical form: tin
sense: 00213460-v
part of speech: verb

00213460-v
type: LexicalConcept
in scheme: en-word.net
definition: prepare (a metal) for soldering or brazing by applying a thin layer of solder to the surface
ili: i22783
lexfile: verb.change
part of speech: verb
hypernym: 01397703-v