dissociate-v
type: LexicalEntry
canonical form: dissociate
sense: 00210024-v
part of speech: verb

00210024-v
type: LexicalConcept
in scheme: en-word.net
definition: to undergo a reversible or temporary breakdown of a molecule into simpler molecules or atoms
example: acids dissociate to give hydrogen ions
ili: i22767
lexfile: verb.change
part of speech: verb
domain topic: 06094057-n
hypernym: 00209582-v