abuse-v
type: LexicalEntry
canonical form: abuse
sense: 00203918-v
part of speech: verb

00203918-v
type: LexicalConcept
in scheme: en-word.net
definition: use wrongly or improperly or excessively
example: Her husband often abuses alcohol
example: while she was pregnant, she abused drugs
ili: i22741
lexfile: verb.change
part of speech: verb
hypernym: 01159815-v