transfer-n
type: LexicalEntry
canonical form: transfer
sense: 00202520-n
part of speech: noun

transference-n
type: LexicalEntry
canonical form: transference
sense: 00202520-n
part of speech: noun

00202520-n
type: LexicalConcept
in scheme: en-word.net
definition: the act of transferring something from one form to another
example: the transfer of the music from record to tape suppressed much of the background noise
ili: i36467
lexfile: noun.act
part of speech: noun
hypernym: 00199979-n