burn off-v
type: LexicalEntry
canonical form: burn off
sense: 00196596-v
part of speech: verb

00196596-v
type: LexicalConcept
in scheme: en-word.net
definition: clear land of its vegetation by burning it off
ili: i22701
lexfile: verb.change
part of speech: verb
hypernym: 00195256-v