run-n
type: LexicalEntry
canonical form: run
sense: 00190414-n
part of speech: noun

tally-n
type: LexicalEntry
canonical form: tally
sense: 00190414-n
part of speech: noun

00190414-n
type: LexicalConcept
in scheme: en-word.net
definition: a score in baseball made by a runner touching all four bases safely
example: the Yankees scored 3 runs in the bottom of the 9th
example: their first tally came in the 3rd inning
ili: i36409
lexfile: noun.act
part of speech: noun
domain topic: 00472688-n
hypernym: 00187483-n