interleave-v
type: LexicalEntry
canonical form: interleave
sense: 00189696-v
part of speech: verb

00189696-v
type: LexicalConcept
in scheme: en-word.net
definition: intersperse alternately, as of protective covers for book illustrations
ili: i22661
lexfile: verb.change
part of speech: verb
hypernym: 00189521-v