intersperse-v
type: LexicalEntry
canonical form: intersperse
sense: 00189521-v
part of speech: verb

interlard-v
type: LexicalEntry
canonical form: interlard
sense: 00189521-v
part of speech: verb

00189521-v
type: LexicalConcept
in scheme: en-word.net
definition: introduce one's writing or speech with certain expressions
ili: i22660
lexfile: verb.change
part of speech: verb
hypernym: 00187671-v