safety-n
type: LexicalEntry
canonical form: safety
sense: 00189469-n
part of speech: noun

00189469-n
type: LexicalConcept
in scheme: en-word.net
definition: a score in American football; a player is tackled behind their own goal line
ili: i36403
lexfile: noun.act
part of speech: noun
domain topic: 00470726-n
hypernym: 00187483-n