plug-v
type: LexicalEntry
canonical form: plug
sense: 00188458-v
part of speech: verb

00188458-v
type: LexicalConcept
in scheme: en-word.net
definition: replace the center of a coin with a baser metal
example: plug a nickle
lexfile: verb.change
part of speech: verb
hypernym: 00187671-v