clog-v
type: LexicalEntry
canonical form: clog
sense: 00182182-v
part of speech: verb

overload-v
type: LexicalEntry
canonical form: overload
sense: 00182182-v
part of speech: verb

00182182-v
type: LexicalConcept
in scheme: en-word.net
definition: fill to excess so that function is impaired
example: Fear clogged her mind
example: The story was clogged with too many details
ili: i22621
lexfile: verb.change
part of speech: verb
hypernym: 00453467-v