clear-v
type: LexicalEntry
canonical form: clear
sense: 00178349-v
part of speech: verb

clear up-v
type: LexicalEntry
canonical form: clear up
sense: 00178349-v
part of speech: verb

00178349-v
type: LexicalConcept
in scheme: en-word.net
definition: free (the throat) by making a rasping sound
example: Clear the throat
ili: i22594
lexfile: verb.change
part of speech: verb
hypernym: 00173351-v