instrument-n
type: LexicalEntry
canonical form: instrument
sense: 00174610-n
part of speech: noun

tool-n
type: LexicalEntry
canonical form: tool
sense: 00174610-n
part of speech: noun

00174610-n
type: LexicalConcept
in scheme: en-word.net
definition: the means whereby some act is accomplished
example: my greed was the instrument of my destruction
example: science has given us new tools to fight disease
ili: i36325
lexfile: noun.act
part of speech: noun
hypernym: 00173531-n