exchange-n
type: LexicalEntry
canonical form: exchange
sense: 00167884-n
part of speech: noun

00167884-n
type: LexicalConcept
in scheme: en-word.net
definition: (chess) the capture by both players (usually on consecutive moves) of pieces of equal value
example: the endgame began after the exchange of queens
ili: i36287
lexfile: noun.act
part of speech: noun
domain topic: 00504248-n
hypernym: 00167523-n