recognition-n
type: LexicalEntry
canonical form: recognition
sense: 00166384-n
part of speech: noun

00166384-n
type: LexicalConcept
in scheme: en-word.net
definition: designation by the chair granting a person the right to speak in a deliberative body
example: he was unable to make his motion because he couldn't get recognition by the chairman
ili: i36279
lexfile: noun.act
part of speech: noun
hypernym: 00164600-n