intention-n
type: LexicalEntry
canonical form: intention
sense: 00164054-n
part of speech: noun

00164054-n
type: LexicalConcept
in scheme: en-word.net
definition: an act of intending; a volition that you intend to carry out
example: my intention changed once I saw her
ili: i36268
lexfile: noun.act
part of speech: noun
hypernym: 00163868-n