dissimilate-v
type: LexicalEntry
canonical form: dissimilate
sense: 00160688-v
part of speech: verb

00160688-v
type: LexicalConcept
in scheme: en-word.net
definition: make dissimilar; cause to become less similar
ili: i22513
lexfile: verb.change
part of speech: verb
hypernym: 00126072-v