manipulation-n
type: LexicalEntry
canonical form: manipulation
sense: 00159005-n
part of speech: noun

use-n
type: LexicalEntry
canonical form: use
sense: 00159005-n
part of speech: noun

00159005-n
type: LexicalConcept
in scheme: en-word.net
definition: exerting shrewd or devious influence especially for one's own advantage
example: his manipulation of his friends was scandalous
ili: i36244
lexfile: noun.act
part of speech: noun
hypernym: 00157901-n