due-a
type: LexicalEntry
canonical form: due
sense: https://en-word.net/lemma/due-a#00138993-a
part of speech: adjective

https://en-word.net/synset/00138993-a
type: LexicalConcept
in scheme: en-word.net
definition: suitable to or expected in the circumstances
example: all due respect
example: due cause to honor them
example: a long due promotion
example: in due course
example: due esteem
example: exercising due care
ili: i737
lexfile: adj.all
part of speech: adjective