improper-a
type: LexicalEntry
canonical form: improper
sense: 00137256-s
part of speech: adjective

wrong-a
type: LexicalEntry
canonical form: wrong
sense: 00137256-s
part of speech: adjective

00137256-s
type: LexicalConcept
in scheme: en-word.net
definition: not appropriate for a purpose or occasion
example: said all the wrong things
ili: i727
lexfile: adj.all
part of speech: adjective satellite
similar: https://en-word.net/synset/00136789-a