dig-n
type: LexicalEntry
canonical form: dig
sense: 00136131-n
part of speech: noun

jab-n
type: LexicalEntry
canonical form: jab
sense: 00136131-n
part of speech: noun

00136131-n
type: LexicalConcept
in scheme: en-word.net
definition: the act of touching someone suddenly with your finger or elbow
example: she gave me a sharp dig in the ribs
ili: i36125
lexfile: noun.act
part of speech: noun
hypernym: 00047263-n