base hit-n
type: LexicalEntry
canonical form: base hit
sense: 00131910-n
part of speech: noun

safety-n
type: LexicalEntry
canonical form: safety
sense: 00131910-n
part of speech: noun

00131910-n
type: LexicalConcept
in scheme: en-word.net
definition: (baseball) the successful act of striking a baseball in such a way that the batter reaches base safely
ili: i36097
lexfile: noun.act
part of speech: noun
domain topic: 00472688-n
hypernym: 00044640-n