roll-v
type: LexicalEntry
canonical form: roll
sense: 00124886-v
part of speech: verb

roll up-v
type: LexicalEntry
canonical form: roll up
sense: 00124886-v
part of speech: verb

00124886-v
type: LexicalConcept
in scheme: en-word.net
definition: show certain properties when being rolled
example: The carpet rolls unevenly
example: dried-out tobacco rolls badly
ili: i22383
lexfile: verb.change
part of speech: verb
hypernym: 00109468-v
similar: 00436641-v
similar: 00436806-v