forwarding-n
type: LexicalEntry
canonical form: forwarding
sense: 00122465-n
part of speech: noun

00122465-n
type: LexicalConcept
in scheme: en-word.net
definition: the act of sending on to another destination
example: the forwarding of mail to a new address is done automatically
example: the forwarding of resumes to the personnel department
ili: i36044
lexfile: noun.act
part of speech: noun
hypernym: 00122186-n