wan-a
type: LexicalEntry
canonical form: wan
sense: 00120560-s
part of speech: adjective

00120560-s
type: LexicalConcept
in scheme: en-word.net
definition: lacking vitality as from weariness or illness or unhappiness
example: a wan smile
ili: i632
lexfile: adj.all
part of speech: adjective satellite
similar: https://en-word.net/synset/00120219-a