blush-n
type: LexicalEntry
canonical form: blush
sense: 00119088-n
part of speech: noun

flush-n
type: LexicalEntry
canonical form: flush
sense: 00119088-n
part of speech: noun

00119088-n
type: LexicalConcept
in scheme: en-word.net
definition: sudden reddening of the face (as from embarrassment or guilt or shame or modesty)
ili: i36026
lexfile: noun.act
part of speech: noun
hypernym: 00865191-n