differentiate-v
type: LexicalEntry
canonical form: differentiate
sense: 00118882-v
part of speech: verb

00118882-v
type: LexicalConcept
in scheme: en-word.net
definition: become distinct and acquire a different character
ili: i22354
lexfile: verb.change
part of speech: verb
hypernym: 00160461-v