belching-n
type: LexicalEntry
canonical form: belching
sense: 00118630-n
part of speech: noun

00118630-n
type: LexicalConcept
in scheme: en-word.net
definition: the forceful expulsion of something from inside
example: the belching of smoke from factory chimneys
ili: i36024
lexfile: noun.act
part of speech: noun
hypernym: 00117507-n