shade-v
type: LexicalEntry
canonical form: shade
sense: 00113228-v
part of speech: verb

00113228-v
type: LexicalConcept
in scheme: en-word.net
definition: pass from one quality such as color to another by a slight degree
example: the butterfly wings shade to yellow
ili: i22326
lexfile: verb.change
part of speech: verb
hypernym: 00109468-v
similar: 00113413-v