change-v
type: LexicalEntry
canonical form: change
sense: 00109468-v
part of speech: verb

00109468-v
type: LexicalConcept
in scheme: en-word.net
definition: undergo a change; become different in essence; losing one's or its original nature
example: She changed completely as she grew older
example: The weather changed last night
ili: i22325
lexfile: verb.change
part of speech: verb
hypernym: 02372362-v