stub-v
type: LexicalEntry
canonical form: stub
sense: 00102174-v
part of speech: verb

00102174-v
type: LexicalConcept
in scheme: en-word.net
definition: strike (one's toe) accidentally against an object
example: She stubbed her toe in the dark and now it's broken
ili: i22285
lexfile: verb.body
part of speech: verb
hypernym: 01238728-v