warm up-v
type: LexicalEntry
canonical form: warm up
sense: 00100659-v
part of speech: verb

00100659-v
type: LexicalConcept
in scheme: en-word.net
definition: cause to do preliminary exercises so as to stretch the muscles
example: The coach warmed up the players before the game
ili: i22277
lexfile: verb.body
part of speech: verb
hypernym: 00407168-v