mechanism-n
type: LexicalEntry
canonical form: mechanism
sense: 00099205-n
part of speech: noun

mechanics-n
type: LexicalEntry
canonical form: mechanics
sense: 00099205-n
part of speech: noun

00099205-n
type: LexicalConcept
in scheme: en-word.net
definition: the technical aspects of doing something
example: a mechanism of social control
example: mechanisms of communication
example: the mechanics of prose style
ili: i35920
lexfile: noun.act
part of speech: noun
hypernym: 00098324-n