instrumentation-n
type: LexicalEntry
canonical form: instrumentation
sense: 00098168-n
part of speech: noun

00098168-n
type: LexicalConcept
in scheme: en-word.net
definition: the act of providing or using the instruments needed for some implementation
ili: i35916
lexfile: noun.act
part of speech: noun
hypernym: 00044888-n