infect-v
type: LexicalEntry
canonical form: infect
sense: 00088465-v
part of speech: verb

taint-v
type: LexicalEntry
canonical form: taint
sense: 00088465-v
part of speech: verb

00088465-v
type: LexicalConcept
in scheme: en-word.net
definition: contaminate with a disease or microorganism
ili: i22214
lexfile: verb.body
part of speech: verb
hypernym: 00493642-v