poultice-v
type: LexicalEntry
canonical form: poultice
sense: 00082682-v
part of speech: verb

plaster-v
type: LexicalEntry
canonical form: plaster
sense: 00082682-v
part of speech: verb

00082682-v
type: LexicalConcept
in scheme: en-word.net
definition: dress by covering with a therapeutic substance
ili: i22185
lexfile: verb.body
part of speech: verb
domain topic: 00613447-n
hypernym: 00082467-v