fluff-n
type: LexicalEntry
canonical form: fluff
sense: 00076892-n
part of speech: noun

00076892-n
type: LexicalConcept
in scheme: en-word.net
definition: a blunder (especially an actor's forgetting the lines)
ili: i35807
lexfile: noun.act
part of speech: noun
hypernym: 00075610-n