immune-a
type: LexicalEntry
canonical form: immune
sense: 00072889-s
part of speech: adjective

00072889-s
type: LexicalConcept
in scheme: en-word.net
definition: (usually followed by ‘to’) not affected by a given influence
example: immune to persuasion
ili: i379
lexfile: adj.all
part of speech: adjective satellite
similar: https://en-word.net/synset/00072600-a