error-n
type: LexicalEntry
canonical form: error
sense: 00072888-n
part of speech: noun

misplay-n
type: LexicalEntry
canonical form: misplay
sense: 00072888-n
part of speech: noun

00072888-n
type: LexicalConcept
in scheme: en-word.net
definition: (baseball) a failure of a defensive player to make an out when normal play would have sufficed
ili: i35787
lexfile: noun.act
part of speech: noun
domain topic: 00472688-n
hypernym: 00067456-n