sporting-a
type: LexicalEntry
canonical form: sporting
sense: 00067174-s
part of speech: adjective

00067174-s
type: LexicalConcept
in scheme: en-word.net
definition: involving risk or willingness to take a risk
example: a sporting chance
example: sporting blood
ili: i347
lexfile: adj.all
part of speech: adjective satellite
similar: https://en-word.net/synset/00066400-a