evasion-n
type: LexicalEntry
canonical form: evasion
sense: 00059947-n
part of speech: noun

00059947-n
type: LexicalConcept
in scheme: en-word.net
definition: the act of physically escaping from something (an opponent or a pursuer or an unpleasant situation) by some adroit maneuver
ili: i35716
lexfile: noun.act
part of speech: noun
hypernym: 00059563-n