retreat-n
type: LexicalEntry
canonical form: retreat
sense: 00055303-n
part of speech: noun

00055303-n
type: LexicalConcept
in scheme: en-word.net
definition: the act of withdrawing or going backward (especially to escape something hazardous or unpleasant)
ili: i35691
lexfile: noun.act
part of speech: noun
hypernym: 00054733-n