intrusion-n
type: LexicalEntry
canonical form: intrusion
sense: 00050289-n
part of speech: noun

00050289-n
type: LexicalConcept
in scheme: en-word.net
definition: entrance by force or without permission or welcome
ili: i35663
lexfile: noun.act
part of speech: noun
hypernym: 00049744-n