disposal-n
type: LexicalEntry
canonical form: disposal
sense: 00044347-n
part of speech: noun

disposition-n
type: LexicalEntry
canonical form: disposition
sense: 00044347-n
part of speech: noun

00044347-n
type: LexicalConcept
in scheme: en-word.net
definition: the act or means of getting rid of something
ili: i35637
lexfile: noun.act
part of speech: noun
hypernym: 00030657-n