actual-a
type: LexicalEntry
canonical form: actual
sense: https://en-word.net/lemma/actual-a#00043985-a
part of speech: adjective

existent-a
type: LexicalEntry
canonical form: existent
sense: https://en-word.net/lemma/existent-a#00043985-a
part of speech: adjective

https://en-word.net/synset/00043985-a
type: LexicalConcept
in scheme: en-word.net
definition: presently existing in fact and not merely potential or possible
example: the predicted temperature and the actual temperature were markedly different
example: actual and imagined conditions
ili: i223
lexfile: adj.all
part of speech: adjective
attribute: 13978104-n
similar: 00044352-s