application-n
type: LexicalEntry
canonical form: application
sense: 00036782-n
part of speech: noun

00036782-n
type: LexicalConcept
in scheme: en-word.net
definition: the action of putting something into operation
example: the application of maximum thrust
example: massage has far-reaching medical applications
example: the application of indexes to tables of data
ili: i35603
lexfile: noun.act
part of speech: noun
hypernym: 00038116-n