cleanse-v
type: LexicalEntry
canonical form: cleanse
sense: 00035769-v
part of speech: verb

clean-v
type: LexicalEntry
canonical form: clean
sense: 00035769-v
part of speech: verb

00035769-v
type: LexicalConcept
in scheme: en-word.net
definition: clean one's body or parts thereof, as by washing
example: clean up before you see your grandparents
example: clean your fingernails before dinner
ili: i21945
lexfile: verb.body
part of speech: verb
hypernym: 00040084-v