social relation-n
type: LexicalEntry
canonical form: social relation
sense: 00033122-n
part of speech: noun

00033122-n
type: LexicalConcept
in scheme: en-word.net
definition: a relation between living organisms (especially between people)
ili: i35592
lexfile: noun.Tops
part of speech: noun
hypernym: 00032220-n